Reaction Details
TargetMalate dehydrogenase
LigandBDBM50111589
Substrate/Competitorn/a
Meas. Tech.ChEMBL_103875 (CHEMBL712992)
IC50 25000±n/a nM
Citation McGovern, SLShoichet, BK Kinase inhibitors: not just for kinases anymore. J Med Chem46:1478-83 (2003) 
 
Malate dehydrogenase
Name:Malate dehydrogenase
Type:PROTEIN
Mol. Mass.:35423.44
Organism:Thermus thermophilus
Description:ChEMBL_1448377
Residue:327
BDBM50111589
NameBDBM50111589
Synonyms:2-[(3,5-diiodo-4-oxidophenyl)(3,5-diiodo-4-oxocyclohexa-2,5-dien-1-ylidene)methyl]benzoate | 2-[3,5-diiodo-4-olatophenyl(3,5-diiodo-4-oxo-2,5-cyclohexadienyliden)methyl]benzoate
TypeSmall organic molecule
Emp. Form.C20H8I4O4
Mol. Mass.819.8941
SMILES[#8-]-[#6](=O)-c1ccccc1\[#6](=[#6]-1\[#6]=[#6](I)-[#6](=O)-[#6](I)=[#6]-1)-c1cc(I)c(-[#8-])c(I)c1