Reaction Details
TargetMalate dehydrogenase
LigandBDBM50072147
Substrate/Competitorn/a
Meas. Tech.ChEMBL_103875 (CHEMBL712992)
IC50 100000±n/a nM
Citation McGovern, SLShoichet, BK Kinase inhibitors: not just for kinases anymore. J Med Chem46:1478-83 (2003) 
 
Malate dehydrogenase
Name:Malate dehydrogenase
Type:PROTEIN
Mol. Mass.:35423.44
Organism:Thermus thermophilus
Description:ChEMBL_1448377
Residue:327
BDBM50072147
NameBDBM50072147
Synonyms:(2Z,3Z)-2,3-bis(amino(2-aminophenylthio)methylene)succinonitrile 1,4-diamino-2,3-dicyano-1,4-bis[2-aminophenylthio]butadiene monoethanolate 2,3-Bis-[amino-(2-amino-phenylsulfanyl)-methylene]-succinonitrile 2-[1-Amino-1-(2-amino-phenylsulfanyl)-meth-(Z)-ylidene]-3-[1-amino-1-(2-amino-phenylsulfanyl)-meth-(E)-ylidene]-succinonitrile CHEMBL100473 U-0126
TypeSmall organic molecule
Emp. Form.C18H16N6S2
Mol. Mass.380.49
SMILESNc1ccccc1SC(=N)C(C#N)C(C#N)C(=N)Sc1ccccc1N