Reaction Details
TargetCannabinoid receptor 2
LigandBDBM50126867
Substrate/Competitorn/a
Meas. Tech.ChEMBL_46984 (CHEMBL658954)
Ki>1000±n/a nM
Citation López-Rodríguez, MLViso, AOrtega-Gutiérrez, SFowler, CJTiger, Gde Lago, EFernández-Ruiz, JRamos, JA Design, synthesis, and biological evaluation of new inhibitors of the endocannabinoid uptake: comparison with effects on fatty acid amidohydrolase. J Med Chem46:1512-22 (2003) 
 
Cannabinoid receptor 2
Name:Cannabinoid receptor 2
Type:G Protein-Coupled Receptor (GPCR)
Mol. Mass.:39690.94
Organism:Homo sapiens (Human)
Description:P34972
Residue:360
BDBM50126867
NameBDBM50126867
Synonyms:CHEMBL291021 | Icosa-5,8,11,14-tetraenoic acid bis-thiophen-2-ylmethyl-amide
TypeSmall organic molecule
Emp. Form.C30H41NOS2
Mol. Mass.495.783
SMILESCCCCC\C=C/C\C=C/C\C=C/C\C=C/CCCC(=O)N(Cc1cccs1)Cc1cccs1