Reaction Details
TargetCannabinoid receptor 1
LigandBDBM50126866
Substrate/Competitorn/a
Meas. Tech.ChEMBL_46642 (CHEMBL658898)
Ki>1000±n/a nM
Citation López-Rodríguez, MLViso, AOrtega-Gutiérrez, SFowler, CJTiger, Gde Lago, EFernández-Ruiz, JRamos, JA Design, synthesis, and biological evaluation of new inhibitors of the endocannabinoid uptake: comparison with effects on fatty acid amidohydrolase. J Med Chem46:1512-22 (2003) 
 
Cannabinoid receptor 1
Name:Cannabinoid receptor 1
Type:G Protein-Coupled Receptor (GPCR)
Mol. Mass.:52856.55
Organism:Rattus norvegicus (rat)
Description:P20272
Residue:473
BDBM50126866
NameBDBM50126866
Synonyms:CHEMBL39335 | Icosa-5,8,11,14-tetraenoic acid (2-furan-3-yl-ethyl)-amide
TypeSmall organic molecule
Emp. Form.C26H39NO2
Mol. Mass.397.5934
SMILESCCCCC\C=C/C\C=C/C\C=C/C\C=C/CCCC(=O)NCCc1ccoc1