Reaction Details
TargetHistamine H3 receptor
LigandBDBM50126891
Substrate/Competitorn/a
Meas. Tech.ChEMBL_83651 (CHEMBL693111)
Ki 95±n/a nM
Citation Mikó, TLigneau, XPertz, HHGanellin, CRArrang, JMSchwartz, JCSchunack, WStark, H Novel nonimidazole histamine H3 receptor antagonists: 1-(4-(phenoxymethyl)benzyl)piperidines and related compounds. J Med Chem46:1523-30 (2003) 
 
Histamine H3 receptor
Name:Histamine H3 receptor
Type:G Protein-Coupled Receptor (GPCR)
Mol. Mass.:48691.47
Organism:Homo sapiens (Human)
Description:Binding assays were using CHO cells stably expressing hH3R receptors.
Residue:445
BDBM50126891
NameBDBM50126891
Synonyms:1-[4-(4-Chloro-3-fluoro-phenoxymethyl)-benzyl]-piperidine; compound with oxalic acid | CHEMBL39956
TypeSmall organic molecule
Emp. Form.C19H21ClFNO
Mol. Mass.333.828
SMILESFc1cc(OCc2ccc(CN3CCCCC3)cc2)ccc1Cl