Reaction Details
TargetHistamine H3 receptor
LigandBDBM50126899
Substrate/Competitorn/a
Meas. Tech.ChEMBL_83651 (CHEMBL693111)
Ki 129±n/a nM
Citation Mikó, TLigneau, XPertz, HHGanellin, CRArrang, JMSchwartz, JCSchunack, WStark, H Novel nonimidazole histamine H3 receptor antagonists: 1-(4-(phenoxymethyl)benzyl)piperidines and related compounds. J Med Chem46:1523-30 (2003) 
 
Histamine H3 receptor
Name:Histamine H3 receptor
Type:G Protein-Coupled Receptor (GPCR)
Mol. Mass.:48691.47
Organism:Homo sapiens (Human)
Description:Binding assays were using CHO cells stably expressing hH3R receptors.
Residue:445
BDBM50126899
NameBDBM50126899
Synonyms:1-[4-(4-Piperidin-1-ylmethyl-benzyloxy)-phenyl]-ethanone O-methyl-oxime; compound with oxalic acid | CHEMBL35869
TypeSmall organic molecule
Emp. Form.C22H28N2O2
Mol. Mass.352.4699
SMILESCO\N=C(/C)c1ccc(OCc2ccc(CN3CCCCC3)cc2)cc1