Reaction Details
TargetHistamine H3 receptor
LigandBDBM50126903
Substrate/Competitorn/a
Meas. Tech.ChEMBL_83651 (CHEMBL693111)
Ki 42±n/a nM
Citation Mikó, TLigneau, XPertz, HHGanellin, CRArrang, JMSchwartz, JCSchunack, WStark, H Novel nonimidazole histamine H3 receptor antagonists: 1-(4-(phenoxymethyl)benzyl)piperidines and related compounds. J Med Chem46:1523-30 (2003) 
 
Histamine H3 receptor
Name:Histamine H3 receptor
Type:G Protein-Coupled Receptor (GPCR)
Mol. Mass.:48691.47
Organism:Homo sapiens (Human)
Description:Binding assays were using CHO cells stably expressing hH3R receptors.
Residue:445
BDBM50126903
NameBDBM50126903
Synonyms:1-[4-(4-Chloro-3-methyl-phenoxymethyl)-benzyl]-piperidine; compound with oxalic acid | CHEMBL36630
TypeSmall organic molecule
Emp. Form.C20H24ClNO
Mol. Mass.329.864
SMILESCc1cc(OCc2ccc(CN3CCCCC3)cc2)ccc1Cl