Reaction Details
TargetHistamine H1 receptor
LigandBDBM50126899
Substrate/Competitorn/a
Meas. Tech.ChEMBL_84093 (CHEMBL695159)
Kd 3467.37±n/a nM
Citation Mikó, TLigneau, XPertz, HHGanellin, CRArrang, JMSchwartz, JCSchunack, WStark, H Novel nonimidazole histamine H3 receptor antagonists: 1-(4-(phenoxymethyl)benzyl)piperidines and related compounds. J Med Chem46:1523-30 (2003) 
 
Histamine H1 receptor
Name:Histamine H1 receptor
Type:G Protein-Coupled Receptor (GPCR)
Mol. Mass.:55641.53
Organism:Cavia porcellus (domestic guinea pig)
Description:Guinea pig cerebellum was used in binding assay.
Residue:488
BDBM50126899
NameBDBM50126899
Synonyms:1-[4-(4-Piperidin-1-ylmethyl-benzyloxy)-phenyl]-ethanone O-methyl-oxime; compound with oxalic acid | CHEMBL35869
TypeSmall organic molecule
Emp. Form.C22H28N2O2
Mol. Mass.352.4699
SMILESCO\N=C(/C)c1ccc(OCc2ccc(CN3CCCCC3)cc2)cc1