Reaction Details
TargetHistamine H3 receptor
LigandBDBM50126878
Substrate/Competitorn/a
Meas. Tech.ChEMBL_83477 (CHEMBL693948)
Kd 15.85±n/a nM
Citation Mikó, TLigneau, XPertz, HHGanellin, CRArrang, JMSchwartz, JCSchunack, WStark, H Novel nonimidazole histamine H3 receptor antagonists: 1-(4-(phenoxymethyl)benzyl)piperidines and related compounds. J Med Chem46:1523-30 (2003) 
 
Histamine H3 receptor
Name:Histamine H3 receptor
Type:Enzyme Catalytic Domain
Mol. Mass.:48753.61
Organism:GUINEA PIG
Description:HISTAMINE H3 HRH3 GUINEA PIG::Q9JI35
Residue:445
BDBM50126878
NameBDBM50126878
Synonyms:1-[4-(4-Imidazol-1-yl-phenoxymethyl)-benzyl]-piperidine; compound with oxalic acid | CHEMBL38123
TypeSmall organic molecule
Emp. Form.C22H25N3O
Mol. Mass.347.4534
SMILESC(Oc1ccc(cc1)-n1ccnc1)c1ccc(CN2CCCCC2)cc1