Reaction Details
TargetHistamine H3 receptor
LigandBDBM50126875
Substrate/Competitorn/a
Meas. Tech.ChEMBL_83477 (CHEMBL693948)
Kd 30.9±n/a nM
Citation Mikó, TLigneau, XPertz, HHGanellin, CRArrang, JMSchwartz, JCSchunack, WStark, H Novel nonimidazole histamine H3 receptor antagonists: 1-(4-(phenoxymethyl)benzyl)piperidines and related compounds. J Med Chem46:1523-30 (2003) 
 
Histamine H3 receptor
Name:Histamine H3 receptor
Type:Enzyme Catalytic Domain
Mol. Mass.:48753.61
Organism:GUINEA PIG
Description:HISTAMINE H3 HRH3 GUINEA PIG::Q9JI35
Residue:445
BDBM50126875
NameBDBM50126875
Synonyms:CHEMBL39951 | Cyclopentyl-[4-(4-piperidin-1-ylmethyl-benzyloxy)-phenyl]-methanone; compound with oxalic acid
TypeSmall organic molecule
Emp. Form.C25H31NO2
Mol. Mass.377.5191
SMILESO=C(C1CCCC1)c1ccc(OCc2ccc(CN3CCCCC3)cc2)cc1