Reaction Details
TargetKappa-type opioid receptor
LigandBDBM50381677
Substrate/Competitorn/a
Meas. Tech.ChEMBL_147243 (CHEMBL755511)
EC50 26±n/a nM
Citation Grundt, PJales, ARTraynor, JRLewis, JWHusbands, SM 14-amino, 14-alkylamino, and 14-acylamino analogs of oxymorphindole. Differential effects on opioid receptor binding and functional profiles. J Med Chem46:1563-6 (2003) 
 
Kappa-type opioid receptor
Name:Kappa-type opioid receptor
Type:G Protein-Coupled Receptor (GPCR)
Mol. Mass.:42648.76
Organism:Homo sapiens (Human)
Description:P41145
Residue:380
BDBM50381677
NameBDBM50381677
Synonyms:CHEMBL1256748 | U-69593
TypeSmall organic molecule
Emp. Form.C22H32N2O2
Mol. Mass.356.5017
SMILESCN([C@H]1C[C@@]2(CCCO2)CC[C@@H]1N1CCCC1)C(=O)Cc1ccccc1