Reaction Details
TargetKappa-type opioid receptor
LigandBDBM50027096
Substrate/Competitorn/a
Meas. Tech.ChEMBL_145233 (CHEMBL755684)
Ki 723±n/a nM
Citation Grundt, PJales, ARTraynor, JRLewis, JWHusbands, SM 14-amino, 14-alkylamino, and 14-acylamino analogs of oxymorphindole. Differential effects on opioid receptor binding and functional profiles. J Med Chem46:1563-6 (2003) 
 
Kappa-type opioid receptor
Name:Kappa-type opioid receptor
Type:G Protein-Coupled Receptor (GPCR)
Mol. Mass.:42648.76
Organism:Homo sapiens (Human)
Description:P41145
Residue:380
BDBM50027096
NameBDBM50027096
Synonyms:CHEMBL2113381
TypeSmall organic molecule
Emp. Form.C28H31N3O3
Mol. Mass.457.564
SMILES[H][C@@]12Oc3c4c(CC5N(C)CC[C@@]14[C@]5(Cc1c2[nH]c2ccccc12)NC(=O)CCCC)ccc3O