Reaction Details
TargetMu-type opioid receptor
LigandBDBM50027099
Substrate/Competitorn/a
Meas. Tech.ChEMBL_148088 (CHEMBL754376)
Ki 4.9±n/a nM
Citation Grundt, PJales, ARTraynor, JRLewis, JWHusbands, SM 14-amino, 14-alkylamino, and 14-acylamino analogs of oxymorphindole. Differential effects on opioid receptor binding and functional profiles. J Med Chem46:1563-6 (2003) 
 
Mu-type opioid receptor
Name:Mu-type opioid receptor
Type:G Protein-Coupled Receptor (GPCR)
Mol. Mass.:44789.51
Organism:Homo sapiens (Human)
Description:P35372
Residue:400
BDBM50027099
NameBDBM50027099
Synonyms:CHEMBL2113380
TypeSmall organic molecule
Emp. Form.C32H32N2O2
Mol. Mass.476.6087
SMILES[H][C@@]12Oc3c4c(CC5N(C)CC[C@@]14[C@@]5(CCCc1ccccc1)Cc1c2[nH]c2ccccc12)ccc3O