Reaction Details
TargetMu-type opioid receptor
LigandBDBM50027101
Substrate/Competitorn/a
Meas. Tech.ChEMBL_145591 (CHEMBL749736)
EC50>1000±n/a nM
Citation Grundt, PJales, ARTraynor, JRLewis, JWHusbands, SM 14-amino, 14-alkylamino, and 14-acylamino analogs of oxymorphindole. Differential effects on opioid receptor binding and functional profiles. J Med Chem46:1563-6 (2003) 
 
Mu-type opioid receptor
Name:Mu-type opioid receptor
Type:G Protein-Coupled Receptor (GPCR)
Mol. Mass.:44789.51
Organism:Homo sapiens (Human)
Description:P35372
Residue:400
BDBM50027101
NameBDBM50027101
Synonyms:CHEMBL2113376
TypeSmall organic molecule
Emp. Form.C23H23N3O2
Mol. Mass.373.4476
SMILES[H][C@@]12Oc3c4c(CC5N(C)CC[C@@]14[C@@]5(N)Cc1c2[nH]c2ccccc12)ccc3O