Reaction Details
TargetNitric oxide synthase, brain
LigandBDBM22030
Substrate/Competitorn/a
Meas. Tech.ChEMBL_143518 (CHEMBL755131)
Ki 130±n/a nM
Citation Hah, JMMartásek, PRoman, LJSilverman, RB Aromatic reduced amide bond peptidomimetics as selective inhibitors of neuronal nitric oxide synthase. J Med Chem46:1661-9 (2003) 
 
Nitric oxide synthase, brain
Name:Nitric oxide synthase, brain
Type:Enzyme
Mol. Mass.:160570.98
Organism:Rattus norvegicus (rat)
Description:Recombinant nNOS overexpressed in E. coli was used in enzyme assays.
Residue:1429
BDBM22030
NameBDBM22030
Synonyms:(2S)-2-amino-N-[(1S)-3-amino-1-(aminocarbonyl)propyl]-5-{[(E)-imino(nitroamino)methyl]amino}pentanamide (2S)-2-amino-N-[(1S)-3-amino-1-(aminocarbonyl)propyl]-5-{[imino(nitroamino)methyl]amino}pentanamide CHEMBL1204421 CHEMBL481413 L-Arg NO2-L-Dbu-NH2 L-Nomega-nitroarginine-2,4-L-diaminobutyramide | dipeptide amide inhibitor I
TypeSmall organic molecule
Emp. Form.C10H22N8O4
Mol. Mass.318.3329
SMILESNCC[C@H](NC(=O)[C@@H](N)CCCN=C(N)N[N+]([O-])=O)C(N)=O