Reaction Details
TargetNitric oxide synthase, brain
LigandBDBM50127058
Substrate/Competitorn/a
Meas. Tech.ChEMBL_143518 (CHEMBL755131)
Ki 2060±n/a nM
Citation Hah, JMMartásek, PRoman, LJSilverman, RB Aromatic reduced amide bond peptidomimetics as selective inhibitors of neuronal nitric oxide synthase. J Med Chem46:1661-9 (2003) 
 
Nitric oxide synthase, brain
Name:Nitric oxide synthase, brain
Type:Enzyme
Mol. Mass.:160570.98
Organism:Rattus norvegicus (rat)
Description:Recombinant nNOS overexpressed in E. coli was used in enzyme assays.
Residue:1429
BDBM50127058
NameBDBM50127058
Synonyms:CHEMBL45021 | N-{(4S)-4-amino-5-[(3-aminobenzyl)amino]pentyl}-N'-nitroguanidine
TypeSmall organic molecule
Emp. Form.C13H23N7O2
Mol. Mass.309.3674
SMILESN[C@@H](CCCNC(=N)N[N+]([O-])=O)CNCc1cccc(N)c1