Reaction Details
TargetNitric oxide synthase, brain
LigandBDBM50059643
Substrate/Competitorn/a
Meas. Tech.ChEMBL_143518 (CHEMBL755131)
Ki 2000±n/a nM
Citation Hah, JMMartásek, PRoman, LJSilverman, RB Aromatic reduced amide bond peptidomimetics as selective inhibitors of neuronal nitric oxide synthase. J Med Chem46:1661-9 (2003) 
 
Nitric oxide synthase, brain
Name:Nitric oxide synthase, brain
Type:Enzyme
Mol. Mass.:160570.98
Organism:Rattus norvegicus (rat)
Description:Recombinant nNOS overexpressed in E. coli was used in enzyme assays.
Residue:1429
BDBM50059643
NameBDBM50059643
Synonyms:CHEMBL297096 D-Phenylalanine,methoxy-D-Nitroarginine,with 2M of TFA | methyl 2-[1-amino-2-phenyl-(1R)-ethylcarboxamido]-5-imino(nitroamino)methylamino-(2R)-pentanoate
TypeSmall organic molecule
Emp. Form.C16H24N6O5
Mol. Mass.380.399
SMILESCOC(=O)[C@@H](CCCNC(=N)N[N+]([O-])=O)NC(=O)[C@H](N)Cc1ccccc1