Reaction Details
TargetATP-dependent translocase ABCB1
LigandBDBM31772
Substrate/Competitorn/a
Meas. Tech.ChEMBL_148000 (CHEMBL755828)
IC50 7800±n/a nM
Citation Schwab, DFischer, HTabatabaei, APoli, SHuwyler, J Comparison of in vitro P-glycoprotein screening assays: recommendations for their use in drug discovery. J Med Chem46:1716-25 (2003) 
 
ATP-dependent translocase ABCB1
Name:ATP-dependent translocase ABCB1
Type:Protein
Mol. Mass.:140669.02
Organism:Mus musculus (Mouse)
Description:P21447
Residue:1276
BDBM31772
NameBDBM31772
Synonyms:1-[2-(2,4-dichlorobenzyl)oxy-2-(2,4-dichlorophenyl)ethyl]imidazole;nitric acid CHEMBL91 Miconazole US9144538, Miconazole Nitrate | cid_4189
TypeSmall organic molecule
Emp. Form.C18H14Cl4N2O
Mol. Mass.416.129
SMILESClc1ccc(COC(Cn2ccnc2)c2ccc(Cl)cc2Cl)c(Cl)c1