Reaction Details
TargetATP-dependent translocase ABCB1
LigandBDBM31774
Substrate/Competitorn/a
Meas. Tech.ChEMBL_148000 (CHEMBL755828)
IC50 4800±n/a nM
Citation Schwab, DFischer, HTabatabaei, APoli, SHuwyler, J Comparison of in vitro P-glycoprotein screening assays: recommendations for their use in drug discovery. J Med Chem46:1716-25 (2003) 
 
ATP-dependent translocase ABCB1
Name:ATP-dependent translocase ABCB1
Type:Protein
Mol. Mass.:140669.02
Organism:Mus musculus (Mouse)
Description:P21447
Residue:1276
BDBM31774
NameBDBM31774
Synonyms:CHEMBL104 Clotrimazole Mycelex cid_2812
TypeSmall organic molecule
Emp. Form.C22H17ClN2
Mol. Mass.344.837
SMILESClc1ccccc1C(c1ccccc1)(c1ccccc1)n1ccnc1