Reaction Details
TargetCytochrome P450 3A4
LigandBDBM519
Substrate/Competitorn/a
Meas. Tech.ChEMBL_52069 (CHEMBL664809)
IC50 1500±n/a nM
Citation Schwab, DFischer, HTabatabaei, APoli, SHuwyler, J Comparison of in vitro P-glycoprotein screening assays: recommendations for their use in drug discovery. J Med Chem46:1716-25 (2003) 
 
Cytochrome P450 3A4
Name:Cytochrome P450 3A4
Type:Enzyme
Mol. Mass.:57349.57
Organism:Homo sapiens (Human)
Description:n/a
Residue:503
BDBM519
NameBDBM519
Synonyms:(2S)-N-[(2S,3R)-4-[(3S,4aS,8aS)-3-(tert-butylcarbamoyl)-decahydroisoquinolin-2-yl]-3-hydroxy-1-phenylbutan-2-yl]-2-(quinolin-2-ylformamido)butanediamide Fortovase Ro 31-8959 Saquinavir
TypeSmall organic molecule
Emp. Form.C38H50N6O5
Mol. Mass.670.8408
SMILESCC(C)(C)NC(=O)[C@@H]1C[C@@H]2CCCC[C@@H]2CN1C[C@@H](O)[C@H](Cc1ccccc1)NC(=O)[C@H](CC(N)=O)NC(=O)c1ccc2ccccc2n1