Reaction Details
TargetATP-dependent translocase ABCB1
LigandBDBM22893
Substrate/Competitorn/a
Meas. Tech.ChEMBL_148001 (CHEMBL754159)
IC50>50000±n/a nM
Citation Schwab, DFischer, HTabatabaei, APoli, SHuwyler, J Comparison of in vitro P-glycoprotein screening assays: recommendations for their use in drug discovery. J Med Chem46:1716-25 (2003) 
 
ATP-dependent translocase ABCB1
Name:ATP-dependent translocase ABCB1
Type:PROTEIN
Mol. Mass.:141009.67
Organism:Mus musculus
Description:ChEMBL_474396
Residue:1276
BDBM22893
NameBDBM22893
Synonyms:CHEMBL512 ZANTAC | dimethyl[(5-{[(2-{[(E)-1-(methylamino)-2-nitroethenyl]amino}ethyl)sulfanyl]methyl}furan-2-yl)methyl]amine
TypeSmall organic molecule
Emp. Form.C13H22N4O3S
Mol. Mass.314.404
SMILESCN\C([CH-][N+]([O-])=O)=[NH+]/CCSCc1ccc(CN(C)C)o1