Reaction Details
TargetMu-type opioid receptor
LigandBDBM50249017
Substrate/Competitorn/a
Meas. Tech.ChEMBL_149016 (CHEMBL758580)
Ki 0.34±n/a nM
Citation Greiner, ESpetea, MKrassnig, RSchüllner, FAceto, MHarris, LSTraynor, JRWoods, JHCoop, ASchmidhammer, H Synthesis and biological evaluation of 14-alkoxymorphinans. 18. N-substituted 14-phenylpropyloxymorphinan-6-ones with unanticipated agonist properties: extending the scope of common structure-activity relationships. J Med Chem46:1758-63 (2003) 
 
Mu-type opioid receptor
Name:Mu-type opioid receptor
Type:G Protein-Coupled Receptor (GPCR)
Mol. Mass.:44503.11
Organism:Rattus norvegicus (rat)
Description:Competition binding assays were carried out using membrane preparations from transfected HN9.10 cells that constitutively expressed the mu opioid receptor.
Residue:398
BDBM50249017
NameBDBM50249017
Synonyms:14-O-phenylpropylnaltrexone CHEMBL514774 US11534436, Compound Table B.14 | US9656961, Example 00131
TypeSmall organic molecule
Emp. Form.C29H33NO4
Mol. Mass.459.5766
SMILESOc1ccc2C[C@H]3N(CC4CC4)CC[C@@]45[C@@H](Oc1c24)C(=O)CC[C@@]35OCCCc1ccccc1