Reaction Details
TargetCarbonic anhydrase 2
LigandBDBM50146755
Substrate/Competitorn/a
Meas. Tech.ChEMBL_45042 (CHEMBL658040)
Ki 3.8±n/a nM
Citation de Leval, XIlies, MCasini, ADogné, JMScozzafava, AMasini, EMincione, FStarnotti, MSupuran, CT Carbonic anhydrase inhibitors: synthesis and topical intraocular pressure lowering effects of fluorine-containing inhibitors devoid of enhanced reactivity. J Med Chem47:2796-804 (2004) 
 
Carbonic anhydrase 2
Name:Carbonic anhydrase 2
Type:Enzyme
Mol. Mass.:29250.71
Organism:Homo sapiens (Human)
Description:P00918
Residue:260
BDBM50146755
NameBDBM50146755
Synonyms:2,3,5,6-Tetrafluoro-N-(2-fluoro-4-sulfamoyl-phenyl)-benzenesulfonamide | CHEMBL540698
TypeSmall organic molecule
Emp. Form.C12H7F5N2O4S2
Mol. Mass.402.317
SMILESNS(=O)(=O)c1ccc(NS(=O)(=O)c2c(F)c(F)cc(F)c2F)c(F)c1