Reaction Details
TargetCarbonic anhydrase 2
LigandBDBM50144820
Substrate/Competitorn/a
Meas. Tech.ChEMBL_45042 (CHEMBL658040)
Ki 2.1±n/a nM
Citation de Leval, XIlies, MCasini, ADogné, JMScozzafava, AMasini, EMincione, FStarnotti, MSupuran, CT Carbonic anhydrase inhibitors: synthesis and topical intraocular pressure lowering effects of fluorine-containing inhibitors devoid of enhanced reactivity. J Med Chem47:2796-804 (2004) 
 
Carbonic anhydrase 2
Name:Carbonic anhydrase 2
Type:Enzyme
Mol. Mass.:29250.71
Organism:Homo sapiens (Human)
Description:P00918
Residue:260
BDBM50144820
NameBDBM50144820
Synonyms:2,3,5,6-Tetrafluoro-N-(5-sulfamoyl-[1,3,4]thiadiazol-2-yl)-benzamide | CHEMBL75855
TypeSmall organic molecule
Emp. Form.C9H4F4N4O3S2
Mol. Mass.356.277
SMILESNS(=O)(=O)c1nnc(NC(=O)c2c(F)c(F)cc(F)c2F)s1