Reaction Details
TargetPlasmepsin II
LigandBDBM50071556
Substrate/Competitorn/a
Meas. Tech.ChEMBL_154918 (CHEMBL764692)
Ki 220±n/a nM
Citation Fontaine, FPastor, MSanz, F Incorporating molecular shape into the alignment-free Grid-Independent Descriptors. J Med Chem47:2805-15 (2004) 
 
Plasmepsin II
Name:Plasmepsin II
Type:Enzyme
Mol. Mass.:51482.09
Organism:Plasmodium falciparum
Description:P46925
Residue:453
BDBM50071556
NameBDBM50071556
Synonyms:CHEMBL74943 PS-444035
TypeSmall organic molecule
Emp. Form.C33H48N4O4
Mol. Mass.564.7586
SMILESCCCCNC(=O)CC(O)C(Cc1ccccc1)NC(=O)[C@@H](NC(=O)c1ccc(CN2CCCC2)cc1)[C@@H](C)CC