Reaction Details
TargetHistamine H3 receptor
LigandBDBM22904
Substrate/Competitorn/a
Meas. Tech.ChEMBL_83641 (CHEMBL695771)
Ki 2.7±n/a nM
Citation Zaragoza, FStephensen, HKnudsen, SMPridal, LWulff, BSRimvall, K 1-alkyl-4-acylpiperazines as a new class of imidazole-free histamine H(3) receptor antagonists. J Med Chem47:2833-8 (2004) 
 
Histamine H3 receptor
Name:Histamine H3 receptor
Type:G Protein-Coupled Receptor (GPCR)
Mol. Mass.:48691.47
Organism:Homo sapiens (Human)
Description:Binding assays were using CHO cells stably expressing hH3R receptors.
Residue:445
BDBM22904
NameBDBM22904
Synonyms:(2R)-1-(1H-imidazol-5-yl)propan-2-amine Alpha-Methylhistamine-R CHEMBL268229 RAMH
TypeSmall organic molecule
Emp. Form.C6H11N3
Mol. Mass.125.1716
SMILESC[C@@H](N)Cc1cnc[nH]1