Reaction Details
TargetSodium-dependent dopamine transporter
LigandBDBM86701
Substrate/Competitorn/a
Meas. Tech.ChEMBL_62474 (CHEMBL677366)
Ki 11.8±n/a nM
Citation Kulkarni, SSGrundt, PKopajtic, TKatz, JLNewman, AH Structure-activity relationships at monoamine transporters for a series of N-substituted 3alpha-(bis[4-fluorophenyl]methoxy)tropanes: comparative molecular field analysis, synthesis, and pharmacological evaluation. J Med Chem47:3388-98 (2004) 
 
Sodium-dependent dopamine transporter
Name:Sodium-dependent dopamine transporter
Type:Multi-pass membrane protein
Mol. Mass.:68749.45
Organism:Rattus norvegicus (rat)
Description:P23977
Residue:619
BDBM86701
NameBDBM86701
Synonyms:3-(bis(4-fluorophenyl)methoxy)-8-methyl-8-aza-bicyclo[3.2.1]octane 3-[Bis-(4-fluoro-phenyl)-methoxy]-8-methyl-8-azonia-bicyclo[3.2.1]octane CHEMBL317757 | CHEMBL543113
TypeSmall organic molecule
Emp. Form.C21H23F2NO
Mol. Mass.343.4102
SMILESCN1C2CCC1CC(C2)OC(c1ccc(F)cc1)c1ccc(F)cc1