Reaction Details
Target6-phosphogluconate dehydrogenase, decarboxylating
LigandBDBM50148779
Substrate/Competitorn/a
Meas. Tech.ChEMBL_4339 (CHEMBL619158)
Ki 192000±n/a nM
Citation Dardonville, CRinaldi, EBarrett, MPBrun, RGilbert, IHHanau, S Selective inhibition of Trypanosoma brucei 6-phosphogluconate dehydrogenase by high-energy intermediate and transition-state analogues. J Med Chem47:3427-37 (2004) 
 
6-phosphogluconate dehydrogenase, decarboxylating
Name:6-phosphogluconate dehydrogenase, decarboxylating
Type:Protein
Mol. Mass.:53143.42
Organism:Homo sapiens (Human)
Description:P52209
Residue:483
BDBM50148779
NameBDBM50148779
Synonyms:Acetic acid (1R,2R)-2-acetoxy-1-(acetyl-benzyloxy-aminocarbonyl)-3-(bis-benzyloxy-phosphoryloxy)-propyl ester | CHEMBL113666
TypeSmall organic molecule
Emp. Form.C31H34NO11P
Mol. Mass.627.5755
SMILESCC(=O)O[C@H](COP(=O)(OCc1ccccc1)OCc1ccccc1)[C@@H](OC(C)=O)C(=O)N(OCc1ccccc1)C(C)=O