Reaction Details
Target6-phosphogluconate dehydrogenase, decarboxylating
LigandBDBM50148790
Substrate/Competitorn/a
Meas. Tech.ChEMBL_4339 (CHEMBL619158)
Ki 10700±n/a nM
Citation Dardonville, CRinaldi, EBarrett, MPBrun, RGilbert, IHHanau, S Selective inhibition of Trypanosoma brucei 6-phosphogluconate dehydrogenase by high-energy intermediate and transition-state analogues. J Med Chem47:3427-37 (2004) 
 
6-phosphogluconate dehydrogenase, decarboxylating
Name:6-phosphogluconate dehydrogenase, decarboxylating
Type:Protein
Mol. Mass.:53143.42
Organism:Homo sapiens (Human)
Description:P52209
Residue:483
BDBM50148790
NameBDBM50148790
Synonyms:(2R,3R)-2,3-Dihydroxy-4-phosphonooxy-butyric acid anion
TypeSmall organic molecule
Emp. Form.C4H8O8P
Mol. Mass.215.0758
SMILESO[C@H](COP(O)(O)=O)[C@@H](O)C([O-])=O