Reaction Details
Target6-phosphogluconate dehydrogenase, decarboxylating
LigandBDBM50148770
Substrate/Competitorn/a
Meas. Tech.ChEMBL_4337 (CHEMBL618442)
Ki 198000±n/a nM
Citation Dardonville, CRinaldi, EBarrett, MPBrun, RGilbert, IHHanau, S Selective inhibition of Trypanosoma brucei 6-phosphogluconate dehydrogenase by high-energy intermediate and transition-state analogues. J Med Chem47:3427-37 (2004) 
 
6-phosphogluconate dehydrogenase, decarboxylating
Name:6-phosphogluconate dehydrogenase, decarboxylating
Type:Protein
Mol. Mass.:53143.42
Organism:Homo sapiens (Human)
Description:P52209
Residue:483
BDBM50148770
NameBDBM50148770
Synonyms:((R)-2-Hydroxy-3-phosphonooxy-propane-1-sulfinyl)-acetic acid | CHEMBL117133
TypeSmall organic molecule
Emp. Form.C5H11O8PS
Mol. Mass.262.175
SMILESO[C@H](COP(O)(O)=O)CS(=O)CC(O)=O