Reaction Details
Target6-phosphogluconate dehydrogenase, decarboxylating
LigandBDBM50148777
Substrate/Competitorn/a
Meas. Tech.ChEMBL_4337 (CHEMBL618442)
Ki 3500±n/a nM
Citation Dardonville, CRinaldi, EBarrett, MPBrun, RGilbert, IHHanau, S Selective inhibition of Trypanosoma brucei 6-phosphogluconate dehydrogenase by high-energy intermediate and transition-state analogues. J Med Chem47:3427-37 (2004) 
 
6-phosphogluconate dehydrogenase, decarboxylating
Name:6-phosphogluconate dehydrogenase, decarboxylating
Type:Protein
Mol. Mass.:53143.42
Organism:Homo sapiens (Human)
Description:P52209
Residue:483
BDBM50148777
NameBDBM50148777
Synonyms:2,3,4,5-tetrahydroxy-6-{[hydroxy(dioxido)phosphoranyl]oxy}-4-methylhexanoate
TypeSmall organic molecule
Emp. Form.C7H14O10P
Mol. Mass.289.1555
SMILESCC(O)(C(O)COP(O)([O-])[O-])C(O)C(O)C([O-])=O