Reaction Details
TargetIntegrin alpha-L/beta-2
LigandBDBM50098766
Substrate/Competitorn/a
Meas. Tech.ChEMBL_96789 (CHEMBL703266)
Kd 10000000±n/a nM
Citation Erlanson, DAMcDowell, RSO'Brien, T Fragment-based drug discovery. J Med Chem47:3463-82 (2004) 
 
Integrin alpha-L/beta-2
Name:Integrin alpha-L/beta-2
Type:n/a
Mol. Mass.:n/a
Description:ASSAY_ID of EBI is 32646
Components:This complex has 2 components.
Component 1
Name:Integrin alpha-L
Synonyms:CD11 antigen-like family member A CD_antigen=CD11a ITGAL LFA-1A Leukocyte adhesion glycoprotein LFA-1 alpha chain | Leukocyte function-associated molecule 1 alpha chain
Type:PROTEIN
Mol. Mass.:128748.90
Organism:Homo sapiens (Human)
Description:ChEMBL_629045
Residue:1170
Component 2
Name:Integrin beta-2
Synonyms:CD18 ITGB2 MFI7
Type:PROTEIN
Mol. Mass.:84785.60
Organism:Homo sapiens (Human)
Description:EBI_12662
Residue:769
BDBM50098766
NameBDBM50098766
Synonyms:2,3-Dihydro-benzo[1,4]dioxine | CHEMBL19452
TypeSmall organic molecule
Emp. Form.C8H8O2
Mol. Mass.136.1479
SMILESC1COc2ccccc2O1