Reaction Details
TargetGlycogen phosphorylase, muscle form
LigandBDBM50149297
Substrate/Competitorn/a
Meas. Tech.ChEMBL_138360 (CHEMBL749047)
Ki 11±n/a nM
Citation Kristiansen, MAndersen, BIversen, LFWestergaard, N Identification, synthesis, and characterization of new glycogen phosphorylase inhibitors binding to the allosteric AMP site. J Med Chem47:3537-45 (2004) 
 
Glycogen phosphorylase, muscle form
Name:Glycogen phosphorylase, muscle form
Type:PROTEIN
Mol. Mass.:97097.45
Organism:Homo sapiens (Human)
Description:ChEMBL_1449751
Residue:842
BDBM50149297
NameBDBM50149297
Synonyms:(S)-1-Ethyl-6-methyl-4-phenyl-1,4-dihydro-pyridine-2,3,5-tricarboxylic acid 5-isopropyl ester | CHEMBL324288
TypeSmall organic molecule
Emp. Form.C20H23NO6
Mol. Mass.373.3997
SMILESCCN1C(C)=C([C@H](C(C(O)=O)=C1C(O)=O)c1ccccc1)C(=O)OC(C)C