Reaction Details
TargetAdenosine receptor A3
LigandBDBM21173
Substrate/Competitorn/a
Meas. Tech.ChEMBL_31707 (CHEMBL644951)
Ki 1300±n/a nM
Citation Colotta, VCatarzi, DVarano, FCalabri, FRLenzi, OFilacchioni, GMartini, CTrincavelli, LDeflorian, FMoro, S 1,2,4-triazolo[4,3-a]quinoxalin-1-one moiety as an attractive scaffold to develop new potent and selective human A3 adenosine receptor antagonists: synthesis, pharmacological, and ligand-receptor modeling studies. J Med Chem47:3580-90 (2004) 
 
Adenosine receptor A3
Name:Adenosine receptor A3
Type:G Protein-Coupled Receptor (GPCR)
Mol. Mass.:36197.32
Organism:Homo sapiens (Human)
Description:P0DMS8
Residue:318
BDBM21173
NameBDBM21173
Synonyms:1,3-dipropyl-8-cyclopentylxanthine CHEMBL183 PD116948 | [3H]DPCPX
Typeradiolabeled ligand
Emp. Form.C16H24N4O2
Mol. Mass.304.3874
SMILESCCCn1c2nc([nH]c2c(=O)n(CCC)c1=O)C1CCCC1