Reaction Details
TargetAdenosine receptor A2b
LigandBDBM50150074
Substrate/Competitorn/a
Meas. Tech.ChEMBL_31079 (CHEMBL640610)
EC50 12±n/a nM
Citation Beukers, MWChang, LCvon Frijtag Drabbe Künzel, JKMulder-Krieger, TSpanjersberg, RFBrussee, JIJzerman, AP New, non-adenosine, high-potency agonists for the human adenosine A2B receptor with an improved selectivity profile compared to the reference agonist N-ethylcarboxamidoadenosine. J Med Chem47:3707-9 (2004) 
 
Adenosine receptor A2b
Name:Adenosine receptor A2b
Type:G Protein-Coupled Receptor (GPCR)
Mol. Mass.:36341.22
Organism:Homo sapiens (Human)
Description:n/a
Residue:332
BDBM50150074
NameBDBM50150074
Synonyms:2-Amino-4-(4-hydroxy-phenyl)-6-(1H-imidazol-2-ylmethylsulfanyl)-pyridine-3,5-dicarbonitrile | CHEMBL122622
TypeSmall organic molecule
Emp. Form.C17H12N6OS
Mol. Mass.348.382
SMILESNc1nc(SCc2ncc[nH]2)c(C#N)c(-c2ccc(O)cc2)c1C#N