Reaction Details
TargetD(4) dopamine receptor
LigandBDBM50150143
Substrate/Competitorn/a
Meas. Tech.ChEMBL_61323 (CHEMBL670098)
Ki 3.8±n/a nM
Citation Cowart, MLatshaw, SPBhatia, PDaanen, JFRohde, JNelson, SLPatel, MKolasa, TNakane, MUchic, MEMiller, LNTerranova, MAChang, RDonnelly-Roberts, DLNamovic, MTHollingsworth, PRMartino, BRLynch, JJSullivan, JPHsieh, GCMoreland, RBBrioni, JDStewart, AO Discovery of 2-(4-pyridin-2-ylpiperazin-1-ylmethyl)-1H-benzimidazole (ABT-724), a dopaminergic agent with a novel mode of action for the potential treatment of erectile dysfunction. J Med Chem47:3853-64 (2004) 
 
D(4) dopamine receptor
Name:D(4) dopamine receptor
Type:Enzyme
Mol. Mass.:48373.19
Organism:Homo sapiens (Human)
Description:P21917
Residue:419
BDBM50150143
NameBDBM50150143
Synonyms:2-[4-(2,5-Dimethyl-phenyl)-piperazin-1-ylmethyl]-1H-benzoimidazole | CHEMBL127290
TypeSmall organic molecule
Emp. Form.C20H24N4
Mol. Mass.320.4314
SMILESCc1ccc(C)c(c1)N1CCN(Cc2nc3ccccc3[nH]2)CC1