Reaction Details
TargetD(2) dopamine receptor
LigandBDBM50145075
Substrate/Competitorn/a
Meas. Tech.ChEMBL_60361 (CHEMBL672096)
Ki 15000±n/a nM
Citation Cowart, MLatshaw, SPBhatia, PDaanen, JFRohde, JNelson, SLPatel, MKolasa, TNakane, MUchic, MEMiller, LNTerranova, MAChang, RDonnelly-Roberts, DLNamovic, MTHollingsworth, PRMartino, BRLynch, JJSullivan, JPHsieh, GCMoreland, RBBrioni, JDStewart, AO Discovery of 2-(4-pyridin-2-ylpiperazin-1-ylmethyl)-1H-benzimidazole (ABT-724), a dopaminergic agent with a novel mode of action for the potential treatment of erectile dysfunction. J Med Chem47:3853-64 (2004) 
 
D(2) dopamine receptor
Name:D(2) dopamine receptor
Type:Cell-surface receptors
Mol. Mass.:50647.10
Organism:Homo sapiens (Human)
Description:P14416
Residue:443
BDBM50145075
NameBDBM50145075
Synonyms:2-((4-(pyridin-2-yl)piperazin-1-yl)methyl)-1H-benzo[d]imidazole ABT-724 | CHEMBL440687
TypeSmall organic molecule
Emp. Form.C17H19N5
Mol. Mass.293.3663
SMILESC(N1CCN(CC1)c1ccccn1)c1nc2ccccc2[nH]1