Reaction Details
TargetD(4) dopamine receptor
LigandBDBM50150150
Substrate/Competitorn/a
Meas. Tech.ChEMBL_61169 (CHEMBL672451)
EC50 3.9±n/a nM
Citation Cowart, MLatshaw, SPBhatia, PDaanen, JFRohde, JNelson, SLPatel, MKolasa, TNakane, MUchic, MEMiller, LNTerranova, MAChang, RDonnelly-Roberts, DLNamovic, MTHollingsworth, PRMartino, BRLynch, JJSullivan, JPHsieh, GCMoreland, RBBrioni, JDStewart, AO Discovery of 2-(4-pyridin-2-ylpiperazin-1-ylmethyl)-1H-benzimidazole (ABT-724), a dopaminergic agent with a novel mode of action for the potential treatment of erectile dysfunction. J Med Chem47:3853-64 (2004) 
 
D(4) dopamine receptor
Name:D(4) dopamine receptor
Type:Enzyme
Mol. Mass.:48373.19
Organism:Homo sapiens (Human)
Description:P21917
Residue:419
BDBM50150150
NameBDBM50150150
Synonyms:2-[4-(2-Nitro-phenyl)-piperazin-1-ylmethyl]-1H-benzoimidazole | CHEMBL124927
TypeSmall organic molecule
Emp. Form.C18H19N5O2
Mol. Mass.337.3758
SMILES[O-][N+](=O)c1ccccc1N1CCN(Cc2nc3ccccc3[nH]2)CC1