Reaction Details
TargetMu-type opioid receptor
LigandBDBM50139899
Substrate/Competitorn/a
Meas. Tech.ChEMBL_148530 (CHEMBL755191)
Ki 946±n/a nM
Citation Thomas, JBFix, SERothman, RBMascarella, SWDersch, CMCantrell, BEZimmerman, DMCarroll, FI Importance of phenolic address groups in opioid kappa receptor selective antagonists. J Med Chem47:1070-3 (2004) 
 
Mu-type opioid receptor
Name:Mu-type opioid receptor
Type:G Protein-Coupled Receptor (GPCR)
Mol. Mass.:44503.11
Organism:Rattus norvegicus (rat)
Description:Competition binding assays were carried out using membrane preparations from transfected HN9.10 cells that constitutively expressed the mu opioid receptor.
Residue:398
BDBM50139899
NameBDBM50139899
Synonyms:CHEMBL11285 | N-{(S)-1-[(3R,4R)-4-(3-Hydroxy-phenyl)-3,4-dimethyl-piperidin-1-ylmethyl]-2-methyl-propyl}-3-phenyl-propionamide
TypeSmall organic molecule
Emp. Form.C27H38N2O2
Mol. Mass.422.6028
SMILESCC(C)[C@@H](CN1CC[C@](C)([C@@H](C)C1)c1cccc(O)c1)NC(=O)CCc1ccccc1