Reaction Details
TargetType-2 angiotensin II receptor
LigandBDBM50139783
Substrate/Competitorn/a
Meas. Tech.ChEMBL_35277 (CHEMBL647776)
Ki 0.62±n/a nM
Citation Rosenström, USköld, CLindeberg, GBotros, MNyberg, FKarlén, AHallberg, A A selective AT2 receptor ligand with a gamma-turn-like mimetic replacing the amino acid residues 4-5 of angiotensin II. J Med Chem47:859-70 (2004) 
 
Type-2 angiotensin II receptor
Name:Type-2 angiotensin II receptor
Type:Enzyme Catalytic Domain
Mol. Mass.:41201.61
Organism:Homo sapiens (Human)
Description:Angiotensin II, central 0 0::P50052
Residue:363
BDBM50139783
NameBDBM50139783
Synonyms:Angiotensin II analogue | CHEMBL404996
TypeSmall organic molecule
Emp. Form.C47H65N13O12S2
Mol. Mass.1068.229
SMILESCCSC[C@H](NC(=O)[C@H](Cc1ccc(O)cc1)NC(=O)[C@H](CS)NC(=O)[C@H](CCCNC(N)=N)NC(=O)[C@@H](N)CC(O)=O)C(=O)N[C@@H](Cc1cnc[nH]1)C(=O)N1CCC[C@H]1C(=O)N[C@@H](Cc1ccccc1)C(O)=O