Reaction Details
TargetCytochrome P450 2C9
LigandBDBM50022309
Substrate/Competitorn/a
Meas. Tech.ChEMBL_51556 (CHEMBL661229)
Ki 19000±n/a nM
Citation Afzelius, LZamora, IMasimirembwa, CMKarlén, AAndersson, TBMecucci, SBaroni, MCruciani, G Conformer- and alignment-independent model for predicting structurally diverse competitive CYP2C9 inhibitors. J Med Chem47:907-14 (2004) 
 
Cytochrome P450 2C9
Name:Cytochrome P450 2C9
Type:Enzyme
Mol. Mass.:55636.33
Organism:Homo sapiens (Human)
Description:P11712
Residue:490
BDBM50022309
NameBDBM50022309
Synonyms:3,5-Dioxo-1,2-diphenyl-4-n-butylpyrazolidine 4-n-Butyl-1,2-diphenyl-3,5-pyrazolidinedione PHENYLBUTAZONE | Phenylbutazon
TypeSmall organic molecule
Emp. Form.C19H20N2O2
Mol. Mass.308.3743
SMILESCCCCc1c(O)n(-c2ccccc2)n(-c2ccccc2)c1=O