Reaction Details
TargetCytochrome P450 2C9
LigandBDBM50139803
Substrate/Competitorn/a
Meas. Tech.ChEMBL_51556 (CHEMBL661229)
Ki 3300±n/a nM
Citation Afzelius, LZamora, IMasimirembwa, CMKarlén, AAndersson, TBMecucci, SBaroni, MCruciani, G Conformer- and alignment-independent model for predicting structurally diverse competitive CYP2C9 inhibitors. J Med Chem47:907-14 (2004) 
 
Cytochrome P450 2C9
Name:Cytochrome P450 2C9
Type:Enzyme
Mol. Mass.:55636.33
Organism:Homo sapiens (Human)
Description:P11712
Residue:490
BDBM50139803
NameBDBM50139803
Synonyms:(3S,5S)-fluvastatin (3S,5S,6E)-7-[3-(4-fluorophenyl)-1-isopropyl-1H-indol-2-yl]-3,5-dihydroxyhept-6-enoic acid | CHEMBL170132
TypeSmall organic molecule
Emp. Form.C24H26FNO4
Mol. Mass.411.4659
SMILESCC(C)n1c(\C=C\[C@@H](O)C[C@H](O)CC(O)=O)c(-c2ccc(F)cc2)c2ccccc12