Reaction Details
TargetCytochrome P450 2C9
LigandBDBM50121347
Substrate/Competitorn/a
Meas. Tech.ChEMBL_51556 (CHEMBL661229)
Ki 245000±n/a nM
Citation Afzelius, LZamora, IMasimirembwa, CMKarlén, AAndersson, TBMecucci, SBaroni, MCruciani, G Conformer- and alignment-independent model for predicting structurally diverse competitive CYP2C9 inhibitors. J Med Chem47:907-14 (2004) 
 
Cytochrome P450 2C9
Name:Cytochrome P450 2C9
Type:Enzyme
Mol. Mass.:55636.33
Organism:Homo sapiens (Human)
Description:P11712
Residue:490
BDBM50121347
NameBDBM50121347
Synonyms:CHEMBL625 | THIABENDAZOLE
TypeSmall organic molecule
Emp. Form.C10H7N3S
Mol. Mass.201.248
SMILESc1nc(cs1)-c1nc2ccccc2[nH]1