Reaction Details
TargetCytochrome P450 2C9
LigandBDBM50343352
Substrate/Competitorn/a
Meas. Tech.ChEMBL_51556 (CHEMBL661229)
Ki 20000±n/a nM
Citation Afzelius, LZamora, IMasimirembwa, CMKarlén, AAndersson, TBMecucci, SBaroni, MCruciani, G Conformer- and alignment-independent model for predicting structurally diverse competitive CYP2C9 inhibitors. J Med Chem47:907-14 (2004) 
 
Cytochrome P450 2C9
Name:Cytochrome P450 2C9
Type:Enzyme
Mol. Mass.:55636.33
Organism:Homo sapiens (Human)
Description:P11712
Residue:490
BDBM50343352
NameBDBM50343352
Synonyms:2-hydroxy-3-(3-oxo-1-phenylbutyl)-4H-chromen-4-one 4-Hydroxy-3-(3-oxo-1-phenyl-butyl)-chromen-2-one CHEMBL1464 Jantoven wafarin warfarine
TypeSmall organic molecule
Emp. Form.C19H16O4
Mol. Mass.308.3279
SMILESCC(=O)CC(c1ccccc1)c1c(O)c2ccccc2oc1=O