Reaction Details
TargetMelanocyte-stimulating hormone receptor
LigandBDBM50017181
Substrate/Competitorn/a
Meas. Tech.ChEMBL_105856 (CHEMBL717326)
EC50 0.046000±n/a nM
Citation Han, GHaskell-Luevano, CKendall, LBonner, GHadley, MECone, RDHruby, VJ De novo design, synthesis, and pharmacology of alpha-melanocyte stimulating hormone analogues derived from somatostatin by a hybrid approach. J Med Chem47:1514-26 (2004) 
 
Melanocyte-stimulating hormone receptor
Name:Melanocyte-stimulating hormone receptor
Type:PROTEIN
Mol. Mass.:35238.60
Organism:Mus musculus
Description:ChEMBL_1498846
Residue:315
BDBM50017181
NameBDBM50017181
Synonyms:CHEMBL441738
TypeSmall organic molecule
Emp. Form.C78H111N21O19
Mol. Mass.1646.8452
SMILESCCCC[C@H](NC(=O)[C@H](CO)NC(=O)[C@H](Cc1ccc(O)cc1)NC(=O)[C@H](CO)NC(C)=O)C(=O)N[C@@H](CCC(O)=O)C(=O)N[C@@H](Cc1cnc[nH]1)C(=O)N[C@H](Cc1ccccc1)C(=O)N[C@@H](CCCNC(N)=N)C(=O)N[C@@H](Cc1c[nH]c2ccccc12)C(=O)NCC(=O)N[C@@H](CCCCN)C(=O)N1CCC[C@H]1C(=O)N[C@@H](C(C)C)C(N)=O