Reaction Details
TargetSodium channel protein type 4 subunit alpha
LigandBDBM50141062
Substrate/Competitorn/a
Meas. Tech.ChEMBL_202570 (CHEMBL805351)
Ki 31±n/a nM
Citation Yang, JGharagozloo, PYao, JIlyin, VICarter, RBNguyen, PRobledo, SWoodward, RMHogenkamp, DJ 3-(4-phenoxyphenyl)pyrazoles: a novel class of sodium channel blockers. J Med Chem47:1547-52 (2004) 
 
Sodium channel protein type 4 subunit alpha
Name:Sodium channel protein type 4 subunit alpha
Type:Protein
Mol. Mass.:208010.01
Organism:Homo sapiens (Human)
Description:P35499
Residue:1836
BDBM50141062
NameBDBM50141062
Synonyms:3-[4-(4-Fluoro-phenoxy)-phenyl]-pyrazole-1-carboxylic acid amide | CHEMBL289425
TypeSmall organic molecule
Emp. Form.C16H12FN3O2
Mol. Mass.297.2838
SMILESNC(=O)n1ccc(n1)-c1ccc(Oc2ccc(F)cc2)cc1