Reaction Details
TargetB2 bradykinin receptor
LigandBDBM50142946
Substrate/Competitorn/a
Meas. Tech.ChEMBL_40292 (CHEMBL653424)
IC50 0.28±n/a nM
Citation Sawada, YKayakiri, HAbe, YImai, KMizutani, TInamura, NAsano, MAramori, IHatori, CKatayama, AOku, TTanaka, H A new series of highly potent non-peptide bradykinin B2 receptor antagonists incorporating the 4-heteroarylquinoline framework. Improvement of aqueous solubility and new insights into species difference. J Med Chem47:1617-30 (2004) 
 
B2 bradykinin receptor
Name:B2 bradykinin receptor
Type:Enzyme Catalytic Domain
Mol. Mass.:44467.17
Organism:Homo sapiens (Human)
Description:B2 BRADYKININ BDKRB2 HUMAN::P30411
Residue:391
BDBM50142946
NameBDBM50142946
Synonyms:4-{(E)-2-[({[2,4-Dichloro-3-(2-methyl-4-[1,2,3]triazol-1-yl-quinolin-8-yloxymethyl)-phenyl]-methyl-carbamoyl}-methyl)-carbamoyl]-vinyl}-N,N-dimethyl-benzamide; hydrochloride | CHEMBL541805
TypeSmall organic molecule
Emp. Form.C34H31Cl2N7O4
Mol. Mass.672.56
SMILESCN(C)C(=O)c1ccc(\C=C\C(=O)NCC(=O)N(C)c2ccc(Cl)c(COc3cccc4c(cc(C)nc34)-n3ccnn3)c2Cl)cc1