Reaction Details
TargetTranslocator protein
LigandBDBM50143231
Substrate/Competitorn/a
Meas. Tech.ChEMBL_37506 (CHEMBL648136)
Ki 0.55±n/a nM
Citation Primofiore, GDa Settimo, FTaliani, SSimorini, FPatrizi, MPNovellino, EGreco, GAbignente, ECosta, BChelli, BMartini, C N,N-dialkyl-2-phenylindol-3-ylglyoxylamides. A new class of potent and selective ligands at the peripheral benzodiazepine receptor. J Med Chem47:1852-5 (2004) 
 
Translocator protein
Name:Translocator protein
Type:Mitochondrion membrane protein
Mol. Mass.:18945.84
Organism:Rattus norvegicus (rat)
Description:Competitive binding experiments were performed on rat kidney mitochondrial membranes.
Residue:169
BDBM50143231
NameBDBM50143231
Synonyms:2-[2-(4-Chloro-phenyl)-1H-indol-3-yl]-N,N-dihexyl-2-oxo-acetamide | CHEMBL55162
TypeSmall organic molecule
Emp. Form.C28H35ClN2O2
Mol. Mass.467.043
SMILESCCCCCCN(CCCCCC)C(=O)C(=O)c1c([nH]c2ccccc12)-c1ccc(Cl)cc1