Reaction Details
TargetGeranylgeranyl transferase type-1 subunit beta/Protein farnesyltransferase/geranylgeranyltransferase type-1 subunit alpha
LigandBDBM50143599
Substrate/Competitorn/a
Meas. Tech.ChEMBL_71958 (CHEMBL686123)
IC50 3.6±n/a nM
Citation Bell, IM Inhibitors of farnesyltransferase: a rational approach to cancer chemotherapy? J Med Chem47:1869-78 (2004) 
 
Geranylgeranyl transferase type-1 subunit beta/Protein farnesyltransferase/geranylgeranyltransferase type-1 subunit alpha
Name:Geranylgeranyl transferase type-1 subunit beta/Protein farnesyltransferase/geranylgeranyltransferase type-1 subunit alpha
Type:n/a
Mol. Mass.:n/a
Description:ASSAY_ID of EBI is 70196
Components:This complex has 2 components.
Component 1
Name:Protein farnesyltransferase/geranylgeranyltransferase type-1 subunit alpha
Synonyms:CAAX farnesyltransferase alpha subunit FNTA_HUMAN FTase-alpha Geranylgeranyl Transferase (GGTase-I) Chain A Protein Farnesyltransferase (PFT) Chain A Protein farnesyltransferase Protein farnesyltransferase/geranylgeranyltransferase type I alpha subunit | Ras proteins prenyltransferase alpha
Type:Enzyme
Mol. Mass.:44392.46
Organism:Homo sapiens (Human)
Description:Recombinant human FTase.
Residue:379
Component 2
Name:Geranylgeranyl transferase type-1 subunit beta
Synonyms:2.5.1.59 Geranylgeranyl transferase type I Geranylgeranyl transferase type I subunit beta PGGT1B Protein farnesyl/geranylgeranyl transferase | Type I protein geranyl-geranyltransferase subunit beta
Type:n/a
Mol. Mass.:42369.84
Organism:Homo sapiens (Human)
Description:n/a
Residue:377
BDBM50143599
NameBDBM50143599
Synonyms:2-[3-(3-ETHYL-1-METHYL-2-OXO-AZEPAN-3-YL)-PHENOXY]-4-[1-AMINO-1-(1-METHYL-1H-IMIDIZOL-5-YL)-ETHYL]-BENZONITRILE CHEMBL294888
TypeSmall organic molecule
Emp. Form.C28H33N5O2
Mol. Mass.471.5939
SMILESCC[C@]1(CCCCN(C)C1=O)c1cccc(Oc2cc(ccc2C#N)[C@](C)(N)c2cncn2C)c1