Reaction Details
TargetKappa-type opioid receptor
LigandBDBM50105483
Substrate/Competitorn/a
Meas. Tech.ChEMBL_147223 (CHEMBL754911)
EC50 0.200000±n/a nM
Citation Zhang, AXiong, WHilbert, JEDeVita, EKBidlack, JMNeumeyer, JL 2-aminothiazole-derived opioids. Bioisosteric replacement of phenols. J Med Chem47:1886-8 (2004) 
 
Kappa-type opioid receptor
Name:Kappa-type opioid receptor
Type:G Protein-Coupled Receptor (GPCR)
Mol. Mass.:42648.76
Organism:Homo sapiens (Human)
Description:P41145
Residue:380
BDBM50105483
NameBDBM50105483
Synonyms:(-)-cyclorphan 17-cyclopropylmethyl-(9R)-17-azatetracyclo[7.5.3.01,10.02,7]heptadeca-2(7),3,5-trien-4-ol CHEMBL291468
TypeSmall organic molecule
Emp. Form.C20H27NO
Mol. Mass.297.4345
SMILESOc1ccc2C[C@@H]3C4CCCC[C@]4(CCN3CC3CC3)c2c1